Home > An Error > An Error Occurred While Extracting Files

An Error Occurred While Extracting Files

Contents

If you don't care about signing an installer, then you should remove the installer/publish settings instead of disabling security!! –Jaxidian Dec 8 '15 at 16:31 | show 4 more comments up Re: Getting error while publishing workbook into server Avinash Patel Aug 16, 2012 5:09 AM (in response to Tracy Rodgers) Hi Tracy,Thanks! And where do we make the change? Make sure the object exists and that you spell its name and the path name correctly.The table "table1_FBL1N_Openitems#TXT" does not exist.Errors occurred while trying to load the workbook "CapgeminiPOC/extract". http://dukesoftwaresolutions.com/an-error/an-error-occurred-while-extracting-files-linux.html

visual-studio visual-studio-2010 share|improve this question edited Sep 25 '11 at 20:27 sll 39.7k1059111 asked Sep 25 '11 at 20:22 Alex 43311019 Do you have a few versions of Visual my site show the same error too.. This is the only solution I could understand (with the help of Google) on this page. –chiffa Aug 25 '15 at 16:17 @AlexErygin, why is this a bad solution? asked 5 years ago viewed 45024 times active 4 months ago Visit Chat Linked 0 signtool.exe not found in vs2008 Related 1Visual Studio 2008 SignTool.exe not found0signtool.exe not found in vs2008311Cannot https://discussions.apple.com/thread/1133630?start=30&tstart=0

An Error Occurred While Extracting Files

Click here to Sign upYou can also use the below options to loginLogin with FacebookLogin with GoogleLogin with Yahoo Zoho Corporation Sign In Recent Topics All Forums New Topic Search AllTagsAuthorAdvanced However the user credentials I'm passing in are admin with all permissions . http://whitegloveskleansvcs.zohosites.com/ Thanks Leave a comment on hannywijayanti93's reply Steven111.. Re: Getting error while publishing workbook into server Avinash Patel Aug 13, 2012 4:45 AM (in response to Vusi Nkomo) yes i tried that also , extracting datasource into Tableau datasource

Redefining cases command For document class amsart, the page numbers are too close to the last line Yes, of course I'm an adult! After excluding patch config, publishing works great..... is there a bug on this site?http://mysbaattorney.zohosites.com/ Leave a comment on elfriedaturpiano's reply chanakyas.. An Error Occurred While Extracting Files From The Package Essentials Multiple-Key Sorting Is there a way to make a metal sword resistant to lava?

Leave a comment on tom1111124021452's reply elfriedat.. An Error Occurred While Extracting Files Linux prof_yaffle November 2015 Here it is https://bitbucket.org/klembot/twinejs/issues/216/cant-find-any-story-format-files-when After looking into the problem more it turns out that you only need to delete the file ~/.config/Twine/Local Storage/file__0.localstorage in order to get Twine A professor has only proofread my paper. pop over to these guys Then click Modify > Mark ClickOnce App and then upgrade your VS.

All postings and use of the content on this site are subject to the Apple Support Communities Terms of Use. An Error Occurred While Extracting Files From The Package Essentials.pkg Hackintosh share|improve this answer answered Apr 30 '15 at 4:47 Vignesh 52439 8 This is very bad solution. –Alex Erygin Aug 10 '15 at 20:53 1 I am a fairy Like Show 0 Likes(0) Actions 5. The signtool.exe is located at the following location: %programfiles(x86)%\Microsoft SDKs\Windows\v7.0A\Bin for x64 system %programfiles%\Microsoft SDKs\Windows\v7.0A\Bin for x86 system Please make sure that the file is available there.

An Error Occurred While Extracting Files Linux

Re: An error occurred while publishing 1 year ago Same error occuring for http://swayamsiddhafoundationmumbai.zohosites.com/ plz help Krishna D Re: Re: An error occurred while publishing 1 year ago Hi  Swayamsiddha , We this content silver673.. An Error Occurred While Extracting Files It is a bad solution to Click Once application --> Properties --> Signing -> Uncheck Sign the ClickOnce manifests. An Error Occurred While Extracting Files Truncated Gzip Input Helpful (0) Reply options Link to this post by Researcher, Researcher Sep 20, 2007 2:13 PM in response to Researcher Level 1 (29 points) Mac App Store Sep 20, 2007 2:13

more hot questions question feed about us tour help blog chat data legal privacy policy work here advertising info mobile contact us feedback Technology Life / Arts Culture / Recreation Science Check This Out Re: An error occurred while publishing 4 months ago Hi Zoho site support, I have same issue. Show Ramaprakash Ganesan added a comment - 10/Mar/15 4:31 AM 'There was a configuration setting needed for the Jenkins user in Artifactory which resolved this issue.' What is the exact setting Not the answer you're looking for? An Error Occurred While Extracting Files Ubuntu

If you want to get involved, click one of these buttons! I need quick support.  error num-##6472221## khairul02 Re: Re: An error occurred while publishing 1 year ago Inappropriate (1)Hi, i have same problem too...my site show the same error too.. Apple disclaims any and all liability for the acts, omissions and conduct of any third parties in connection with or related to your use of the site. http://dukesoftwaresolutions.com/an-error/network-connect-mac-an-error-occurred-while-extracting.html Should we contact you every time we need to publish a site?

and why is it like this? An Error Occurred While Browsing Files Hide Permalink Ramaprakash Ganesan added a comment - 10/Mar/15 4:31 AM 'There was a configuration setting needed for the Jenkins user in Artifactory which resolved this issue.' What is the exact Sign In Register Categories Recent Discussions Unanswered Categories 4.2K All Categories1.1K Help!

Why and What changes were made to the configuration ?.

Re: An error occurred while publishing 6 months ago PLEASE PLEASE I NEED TO PUBLISH MY SITE same here "error occured". Select Modify from the set of buttons at the bottom and the above dialog will appear. Pierre November 2015 Hello Martin Not a Chrome error, I think. An Error Occurred While Browsing Files Outlook 2007 It can be downloaded from the following link also: http://www.microsoft.com/download/en/details.aspx?id=17718 Then launch Visual Studio 2010 and publish the ClickOnce Application.

share|improve this answer answered Aug 11 '15 at 8:11 Der_Meister 1,79211419 I'm using windows 10, I can't find SignTool anywhere. How can I resolve this issue ? But what I get is this: Error 94 An error occurred while signing: Failed to sign bin\Debug\app.publish\setup.exe. have a peek here Open the project you are getting this error on.

To disable you go into the properties of your Project (right click) and choose Security | Uncheck Enable ClickOnce security settings. lol Sign In or Register to comment. In my situation, I never used ClickOnce for my applications but after I upgraded to VS 2015 it was suddenly enabled and I got the 'SignTool.exe not found' error when I Re: An error occurred while publishing 9 months ago Hi, I have an error here..

Hopefully will have this figured out in the next couple of days. Try publishing again later." error after having been able to publish just fine since last night...well since 8 am this morning at least. In Control Panel I've updated the installation to include CickOnce Publishing Tools and it worked! I am able to access all folders in my idisk just fine through the finder with the exception of the Web folder, which is where all of the iweb files are

Any help would be appreciated... [ERROR] Internal error: java.lang.RuntimeException: org.jfrog.build.extractor.maven.BuildInfoRecorder.sessionEnded() listener has failed: Error occurred while publishing artifact to Artifactory: /var/lib/jenkins/workspace/my_project/service/target/rpm/my_code/RPMS/noarch/my_code-SNAPSHOT20160201143038.noarch.rpm. [ERROR] Skipping deployment of remaining artifacts (if any) and build My website http://update-mmr.zohosites.com/ has problem when publishing. You should be able to publish the application successfully. Leave a comment on kanmohi's reply wrightmar..

prof_yaffle November 2015 edited November 2015 No, all the data that Twine uses, including the default story formats, is stored in the nw.pak file. All Rights Reserved. Is my workplace warning for texting my boss's private phone at night justified? An error occurred while publishing 9 months ago Hi, I have this error "Error occured while publishing.

But this is the first time I've seen this - I didn't touch any options that would do this. Our sincerest apologies for any inconvenience this may have caused. Build output: Building WindowsFormsApplication… Error: Cannot publish because a project failed to build.