Home > Ant Error > Ant Error Due To Map Failed

Ant Error Due To Map Failed

Thanks, Mike BUILD FAILED Failed to copy my.zip to my.01.zip due to Map failed at org.apache.tools.ant.taskdefs.Copy.doFileOperations(Copy.java:853) at org.apache.tools.ant.taskdefs.Copy.execute(Copy.java:523) at org.apache.tools.ant.UnknownElement.execute(UnknownElement.java:291) at sun.reflect.GeneratedMethodAccessor45.invoke(Unknown Source) at sun.reflect.DelegatingMethodAccessorImpl.invoke(DelegatingMethodAccessor Impl.java:25) at java.lang.reflect.Method.invoke(Method.java:597) at org.apache.tools.ant.dispatch.DispatchUtils.execute(DispatchUtils.java:1 06) Maybe maven runs ant with something like junit's task "haltonerror" but no "haltonfailure"? –user169700 Sep 8 '09 at 7:15 add a comment| Your Answer draft saved draft discarded Sign up Thanks, Mike BUILD FAILED Failed to copy my.zip to my.01.zip due to Map failed at org.apache.tools.ant.taskdefs.Copy.doFileOperations(Copy.java:853) at org.apache.tools.ant.taskdefs.Copy.execute(Copy.java:523) Subtraction with negative result Can an opponent folding make you go from probable winner to probable loser?

With the call 'ant -p' you get a list of targets defined in your build.xml. Since both have the same name the OS (for me it is windows Vista) gives error that it cannot replace a directory with a file that have the same name. Thanks! So I hope this saves others time.

This time, the archiver is failing to find /workspace/target/cobertura/cobertura.ser.lock at the time it is copying. http://bugs.sun.com/bugdatabase/view_bug.do?bug_id=6417205 http://bugs.sun.com/bugdatabase/view_bug.do?bug_id=5092131 could you please indicate what exact version of java you are using? Is this Windows or Unix/Linux/MacOS?

The properties you may wish to set are haltonerror or haltonfailure. if you are using the ant file as build xml then the below steps helps you Steps : open cmd Prompt >> switch to the project location >>type ant and click I am > using the following resolver to connect to the repository: > > m2compatible="true" /> > > The mail libraries are here: > > http://download.java.net/maven/2/com/sun/mail/ > You have your Ant shell script in your PATH either because you included the bin directory of your Ant's HOME directory in your classpath, or (if you're on Unix/Linux/MacOS), you have

If it is, make sure it's the right directory. I downloaded the latest ANT sources and compiled them and replaced ResourceUtils.class in the ant-1.8.1.jar located in the Hudson Webapp, this solved the issue for us, so the commit that was Could this indicate a timing error? click here now more stack exchange communities company blog Stack Exchange Inbox Reputation and Badges sign up log in tour help Tour Start here for a quick overview of the site Help Center Detailed

The failure started occuring when our archive file size became larget than 8GB. [Both slave and master] Windows Server 2008 R2 Java 1.6.0_30 Jenkins 1.470 This trace is slightly different form what does it mean by device here? Hide Permalink koma0277 added a comment - 2010/Aug/25 1:54 AM Looks like a problem with ant 1.8.1 which is used for local to local copy. I know what the right information should be > (it is correct in the dsn mail module) > > If anyone had any suggestions, it would be a really big help.

How does a residential grid-tied solar system work exactly? Renamed back to JAR and started Tomcat. I noticed this error message line: Could not load definitions from resource org/apache/tools/ant/antlib.xml. Hide Permalink Mircea D added a comment - 2015/Apr/23 2:31 PM Yes, restarting Jenkins seems to be a good workaround.

I am using the following resolver to connect to the repository: The mail libraries are here: http://download.java.net/maven/2/com/sun/mail/ When I try and install the mail libraries (imap,pop3 There was the answer of my one week time; explode command creates a directory with the same name. but i cant copy and paste in the add comment tab. I'm trying to see if restarting Jenkins works as a workaround.

This is still an issue in 1.376. Edit: In the comment is shown the call 'ant -verbose build.xml'. Report time: 4391ms [INFO] Cobertura Report generation was successful. [INFO] Cobertura 1.9.4.1 - GNU GPL License (NO WARRANTY) - See COPYRIGHT file Cobertura: Loaded information on 1661 classes. If it is needed to explicitly specify the buildfile (because it's name isn't build.xml for example), you have to specify the buildfile with the '-f'-option: 'ant -verbose -f build.xml'.

The reason why I use ant to run the test is that my application's UI is done in Netbeans Platform. Please type your message and try again. 6 Replies Latest reply on Nov 24, 2009 1:37 AM by Kenan YAZICI Ant Build Failed - failed to copy ~ drools-templates.jar due to Any idea what changed?

For example, if your program is using 6GB of memory mapped file, you may want to pass java -d64 -XX:MaxDirectMemorySize=6g -XX:+UseLargePages BigApp That's all on how to solvejava.io.IOException: Map failed and

I have a directory called /usr/local/bin where I put the command I want to override the commands in /bin and /usr/bin. The file being copied is 840M. If the leakage problem is solved in the JVM, still the memory-mapped size allocated together with the VM size could go over the limit, and this problem may still be present Fix applied in http://svn.apache.org/viewvc?rev=947339&view=rev Comment 9 Stefan Bodewig 2010-05-26 08:45:20 UTC *** Bug 49341 has been marked as a duplicate of this bug. *** Comment 10 Stefan Bodewig 2011-02-24 05:00:53 UTC

We would like to go ahead, make changes and submit the patch but wanted to know if there are any other suggestions that we can try out. - Krishnan Format For The file build.xml in the current directory will be used automatically. I got the error below with -Xmx800M. I had the same problem in two different installations with completely different configuration, except that both were Windows installations.

You can use the jar tvf ant.jar command. Any idea what changed? Normally that is used to make targets 'public' and the others private. Java 1.4 will no longer work with newer versions of Ant.

plz check –christy Jul 6 '09 at 12:53 Thank you very much for adding it to my orginal post :) –christy Jul 6 '09 at 12:54 but So, I solve the problem by changing the deploy target in build.xml. Re: Ant Build Failed - failed to copy ~ drools-templates.jar due to java.io.FileNotFoundException Erik Magnusson Aug 24, 2009 7:46 AM (in response to Rodrigo Dellacqua) Sounds like there is a problem Atlassian Skip navigationJBossDeveloperLog inRegisterJBossDeveloperTechnologyGet StartedGet InvolvedForumsDownloadsHomeNewsContentPlacesPeopleSearchSearchCancelError: You don't have JavaScript enabled.

maven-2 ant share|improve this question edited Dec 5 '10 at 22:39 martin clayton 54.5k13162162 asked Sep 7 '09 at 13:14 user169700 add a comment| 2 Answers 2 active oldest votes up If you're on Unix, don't copy the ant shell script to an executable directory. I lowered it to 750 and it worked. It's using Java 1.6 on 32-bit Windows XP.

can you replace it with the correct one plz ,or can you tell how you did it. –christy Jul 6 '09 at 12:55 | show 1 more comment up vote 0 I used WinZIP, renamed the JAR to ZIP, opened it up in WinZIP, browsed to the correct file in the archive and then drag and drop the new class over the I see the following error: [ivy:install] :: problems summary :: [ivy:install] :::: WARNINGS [ivy:install] io problem while parsing ivy file: http://download.java.net/maven/2/com/sun/mail/smtp/1.4.3/smtp-1.4.3.pom: Impossible to load parent for file:/Users/gcollins/Downloads/apache-ivy-2.1.0/src/example/build-a-ivy-repository/cache/no-namespace/com.sun.mail/smtp/ivy-1.4.3.xml.original. Please Note: this e-mail address is only for reporting problems with ASF Bugzilla.