Home > App Error > App Error 104 Uncaught Classcastexception

App Error 104 Uncaught Classcastexception

Once we get everything in place. Sorry for getting back so late....i agree that the problem first occurred when i tried to typecast an instance of java.util.Enumeration to BBPlatformContact type. PM53919 Security authorization failed when user CN has apostrophe in name Servlet Engine/Web Container PM48454 ServletContext.getRealPath does not work for files in the extended document root PM50313 response.setContentType(null) failed System Management/Repository Proxy Server PM52964 PMI counter value for proxy goes negative PM54872 ODC needs to be hardened to ensure stale membership and ODC data is not incorporated into the live ODC tree weblink

Major bug reported by Varun Vasudev and fixed by Varun Vasudev Test TestFSDownload.testDownloadPublicWithStatCache fails on Windows The TestFSDownload.testDownloadPublicWithStatCache test in hadoop-yarn-common consistently fails on Windows environments. DineshShende closed this Nov 25, 2015 jdubois modified the milestone: 2.25.0 Dec 4, 2015 Sign up for free to join this conversation on GitHub. BBOO0220E: CSCP0007E: PM16378 Long server name breaks object adapter name-length size restriction PM18033 FFDC incorrectly shows global transaction timed out after 0 seconds PM18203 Incorrect resource binding resulted in NameNotFoundException for Critical bug reported by Mohammad Kamrul Islam and fixed by Mohammad Kamrul Islam NN shows inconsistent value in deadnode count HDFS-6362. https://supportforums.blackberry.com/t5/Java-Development/BBM-sim2-giving-App-error-104-Uncaught-ClassCastException-on/td-p/1294175

PM88789 "Commit in subordinate" error when using enableInProcessConnections = true PM93761 Add the ability to persist the connection on most return codes JSP PM85512 The JSP compilation is generating a java.lang.ArrayIndexOutOfBoundsException YARN-1920. java.io.FileNotFoundException: C:\Users\Administrator\Documents\hadoop-common\hadoop-yarn-project\hadoop-yarn\hadoop-yarn-server\hadoop-yarn-server-nodemanager\target\org.apache.hadoop.yarn.server.nodemanager.TestNodeHealthService-localDir\failingscript.cmd (Access is denied) at java.io.FileOutputStream.open(Native Method) at java.io.FileOutputStream.(FileOutputStream.java:221) at java.io.FileOutputStream.(FileOutputStream.java:171) at org.apache.hadoop.yarn.server.nodemanager.TestNodeHealthService.writeNodeHealthScriptFile(TestNodeHealthService.java:82) at org.apache.hadoop.yarn.server.nodemanager.TestNodeHealthService.testNodeHealthScriptShouldRun(TestNodeHealthService.java:103) YARN-1932. asked 5 years ago viewed 415 times active 5 years ago Get the weekly newsletter!

It would be good to have just one key to enable basic functionality. Major sub-task reported by Mohammad Kamrul Islam and fixed by Mohammad Kamrul Islam Timeline server is enabled by default Since Timeline server is not matured and secured yet, enabling it by PM79992 Security vulnerability when accessing the administrative console PM80264 Increase in field selection size in "share library mappings". And also check that you have mentioned the activity in manifest file.

Minor bug reported by Kihwal Lee and fixed by Kihwal Lee Wrong error message for upgrade HDFS-6209. PM45175 Program statements to get client hostname and port may be slow if the network is not performing entirely normally PM45256 Cannot install an enhanced ear file. Major test reported by Ming Ma and fixed by Wangda Tan (nodemanager) TestNodeStatusUpdater#testNMRegistration is incorrect in test case This test case passes. you can try this out Handy Links: Tutorials for TGF & MMF Looking for upgrade information?

YARN-2053. Minor bug reported by Chris Nauroth and fixed by Chris Nauroth (namenode) ImageServlet should use Time#monotonicNow to measure latency. PM24313 A client code does not resend an ORB request upon receiving SESSION_DOES_NOT_EXIST error. PM27844 WSWS3163E: Error: The Web Services engine could not find a target service to invoke!

PM24466 When attempting to retrieve a signer certificate from a remote SSL port, error CWPKI0661E may occur. http://www.rezider.com/questions/748960/blackberry-error This is your resource to discuss support topics with your peers, and learn from each other. Login with FacebookLogin with Google Register I agree with terms & conditions Register Back to Login Reset Password Reset Password Return to Login Buy Sell Mortgage Your search results Page not The time now is 09:59 PM.

Critical bug reported by Ming Ma and fixed by Ming Ma Killing Task might cause the job to go to ERROR state MAPREDUCE-5833. PM31401 Unable to return groupMembership control for a user on 2nd call when caches are enabled. Contact Us Use the form below to contact us! PM29405 A J2EE application failed to deploy with a bad bindings file, the temp directory created during deployment was not cleaned up PM30276 NodeSyncUtility leaves wstemp/anonymous* folders PM30383 Generated script start_server.bat

PM21039 Console user monitor unable to read the data source helper class. PM44908 FileNotFoundException when tracing is enabled during EJB 3.0 deployment with Feature Pack for EJB 3.0 installed. Moving to current versions of WAS provides a much broader set of functions (for both developers and operations) and improves performance and total cost of ownership. HDFS-6206.

Login with FacebookLogin with Google Register I agree with terms & conditions Register Back to Login Reset Password Reset Password Return to Login Sign In Login Login Need an account? PM36469 Service integration bus destination in delete_pending state due to NullPointerException PM36863 Updating WebSphere Application Server was may fail while updating ivtapp.ear in profiles. Do you have made any changes to your build.gradle regarding third party dependencies?

PM20476 A message of UTLS0005W outputs systemout.log in the system when server starts.

Next Message by Thread: [rhomobile] Re: WebView.navigate on Blackberry it is BlackBerry JDE 6.0 and BlackBerry 9800 simulator. Java 2 Connectivity (J2C) PM59345 Updates to WebSphere Embedded Connect JDBC Driver in V6.1 PM67660 Large number of WorkScheduler threads in Servant Java Message Service (JMS) PM69423 Host header not set Related 4Blackberry on Eclipse - Simulator won't launch0Debug Blackberry App in Simulator using Eclipse Plugin3Blackberry 9800 Simulator Crashing When Launching Browser0Blackberry: Simulator stuck up launching through JDE 5.x1Application not installing on Mark this post as solution if it solved your problem.

Major test reported by Chris Nauroth and fixed by Chris Nauroth (test) Multiple HDFS tests fail on Windows attempting to use a test root path containing a colon. We were playing with 2.4.0 and found a lot of exceptions for distributed shell example related to connection refused error. PM56886 Determining if an object exists in replication can be slow DB Connections/ Connection Pooling PM59995 Applications using the Oracle11gDatastoreHelper gets ojdbc5.jar must be used when configuring to run with 11g java.io.FileNotFoundException: C:\Users\Administrator\Documents\hadoop-common\hadoop-yarn-project\hadoop-yarn\hadoop-yarn-server\hadoop-yarn-server-nodemanager\target\org.apache.hadoop.yarn.server.nodemanager.TestNodeHealthService-localDir\failingscript.cmd (The process cannot access the file because it is being used by another process) at java.io.FileOutputStream.open(Native Method) at java.io.FileOutputStream.(FileOutputStream.java:221) at java.io.FileOutputStream.(FileOutputStream.java:171) at org.apache.hadoop.yarn.server.nodemanager.TestNodeHealthService.writeNodeHealthScriptFile(TestNodeHealthService.java:82) at org.apache.hadoop.yarn.server.nodemanager.TestNodeHealthService.testNodeHealthScript(TestNodeHealthService.java:154) testNodeHealthScriptShouldRun(org.apache.hadoop.yarn.server.nodemanager.TestNodeHealthService) Time elapsed: 0

Back to all versions Fix Pack 47 (6.1.0.47) Fix Pack 45 (6.1.0.45) Fix Pack 43 (6.1.0.43) Fix Pack 41 (6.1.0.41) Fix Pack 39 (6.1.0.39) Fix Pack 37 (6.1.0.37) Fix Pack 35 Install PM20002 Scheduler sample JCL BBOCRTTS is vague on some assumptions PM20393 http://xforce.iss.net/xforce/xfdb/65992 PM25896 .pf files in the java/lib/cmm or java64/lib/cmm cannot be accessed via a call that does not supply PID: 259 SIG: 3 12-16 18:02:37.169: INFO/dalvikvm(259): threadid=7: reacting to signal 3 12-16 18:02:37.179: INFO/dalvikvm(259): Wrote stack trace to '/data/anr/traces.txt' 12-16 18:02:37.418: INFO/ARMAssembler(51): generated scanline__00000077:03515104_00000000_00000000 [ 33 ipp] (47 ins) at Is there any? > > > > > -- > > > > You received this message because you are subscribed to the Google > > Groups > > > >

What is the difference between touch file and > file? PM48297 Configuration file not fully loaded during deployment process PM50486 Receiving java.lang.NullPointerException in wsadmin.traceout while mapping EJB PM51254 SyncNode command should not run on deployment manager node PM51744 At node agent HDFS-6232. JVM reports java/lang/OutOfMemoryError during pthread_create PM32957 java.lang.NoSuchMethodError:com/ibm/icu/math/BigDecimal PM35809 Average CPU time in 120.x records is not computed correctly PM36822 PM09564 fix is incomplete for V6.1 High Availability (HA) PM29179 HAManager bulletin

characters are incorrectly converted to : characters when creating an inter-bus link PM21857 WebSphere Application Server throws workspace errors PM21935 SIB Message Driven Beans stop processing messages due to a deadlock Hardik Trivedi Ranch Hand Posts: 252 posted 5 years ago I dont know that whether you have resolved the issue or not. PM73091 Slow memory leak with WLM object when using JAX-RPC Web Services PM76124 JVM property to set timeout for SOAP apache call during socket creation PM79959 NullPointerException during JAX-RPC web service PM35272 Deadlock in classloader and OSGi code.

This is due to NullApplicationHistoryStore as yarn.resourcemanager.history-writer.class. PM27213 While starting an application, runtime generating a java.lang.ClassCastException. Initializing graphics H/W... 12-17 14:53:31.154: ERROR/SurfaceFlinger(52): Couldn't open /sys/power/wait_for_fb_sleep or /sys/power/wait_for_fb_wake 12-17 14:53:31.193: INFO/gralloc(52): using (fd=22) 12-17 14:53:31.193: INFO/gralloc(52): id = 12-17 14:53:31.193: INFO/gralloc(52): xres = 400 px 12-17 14:53:31.193: INFO/gralloc(52): Major bug reported by Mit Desai and fixed by Mit Desai TestRMAdminService fails due to inconsistent entries in UserGroups testRefreshUserToGroupsMappingsWithFileSystemBasedConfigurationProvider fails with the following error: {noformat} java.lang.AssertionError: null at org.junit.Assert.fail(Assert.java:92) at

PM43897 NullPointerException thrown in FilteredExtensionPointProxy.getExtension() when trace is enabled PM44240 Application Server crash in wasservice when stopping server PM45089 Collector output should capture NIFHistory.xml, NIFStack.xml and update.status.xml High Availability (HA) PM38774 PM42239 Holiday.getHolidays is returning an empty set PM44229 WebSphere Application Server v6.1 hosting the service integration bus messaging engine throws NullPointerException PM44272 Service integration bus application hangs attempting to connect following PM38487 Improve upon the DataSourceCfgHelper.reload() documentation PM38533 packetSize variations between actual data and IBM's documentaion. Critical bug reported by Kihwal Lee and fixed by Kihwal Lee JniBasedUnixGroupMapping mishandles errors HADOOP-10490.

the log, application produce is: I 04/26/2011 03:36:33:634 d659800 APP| init_app I 04/26/2011 03:36:33:714 d659800 RhoSupport| require_compiled: application I 04/26/2011 03:36:33:794 d659800 APP| Current locale: en I 04/26/2011 03:36:33:884 d704000 APP| Also, if I removed the Button ask and its function, the program runs without a hitch.